{"text_format":"2","workbook":"xlsx","n_sheets":3,"sheets":["Summary","UFC","KFintech ISC"],"not_rendered":{"charts":0,"images":0,"macros":0,"external_links":1,"defined_names":0,"comments":0,"pivot_tables":1},"unopened":[],"bounds":{"document_bytes":16777216,"sheet_cells":100000,"run_cost":"one","rows_first":2000,"rows_last":500,"rows_between":2000,"halvings":0,"cell_chars":16384,"cell_head_chars":4096},"cells_cut":0,"cells_raw":0,"read":"whole","date_system":"1900"}

{"sheet":"Summary","index":0,"n_rows":5,"n_cols":5,"rows_kept":5,"cut":false,"hidden":false,"merged":[]}
["Count of UFC / BDA / OPA","Labels"]
["UFC Region","UFC","BDA","OPA","Grand Total"]
["Close",0,1,1,2]
["open",167,37,32,236]
["Grand Total",167,38,33,238]

{"sheet":"UFC","index":1,"n_rows":239,"n_cols":16,"rows_kept":239,"cut":false,"hidden":false,"merged":[]}
["Title","UFC / BDA / OPA","Branc Code","Location","Address1","Address2","Address3","City","State","PinCode","Telephone","Fax","IsActive","Modified","Email","Open/Close Status"]
["-","UFC","BN03","Bangalore","No. 28 First Floor ","Centenary Building","M G Road ","Bangalore","Karnataka",560001,"080-25593176","-",true,"-","utibangaloreufc@Kfintech.com","open"]
["-","UFC","JN19","Bangalore-Jayanagar","First Floor No. 76 (Old No. 756) ","10th Main Road 4th Block","Jayanagar","Bangalore","Karnataka",560011,"080-22440837","-",true,"-","utijayanagarufc@Kfintech.com","open"]
["-","UFC","MW17","Bangalore-Malleswaram","No-60 Maruthi Plaza","18Th Cross 8Th Main","Malleswaram","Bangalore","Karnataka",560055,"080-23340672","-",true,"-","utimalleswaramufc@Kfintech.com","open"]
["72","UFC","BG40","Belgaum","R.K. Marg 5Th Cross ","Opp Subhash Market ","Hindwadi ","Belgaum ","Karnataka",590011,"08312 421625","-",true,"-","utibelgaumufc@Kfintech.com","open"]
["73","UFC","BY21","Bellary","Sri Basava Square","2nd Cross Gandhinagar","Gandhi Nagar Bellary ","Bellary","Karnataka",583101,"08392 255634/635","-",true,"-","utibellaryufc@Kfintech.com ","open"]
["83","UFC","DV15","Davangere","#998","Satya Sadana","K B ExtnLawyers Road\n","Davangere","Karnataka",577002,"08192-233566 ","-",true,"-","utidavangereufc@Kfintech.com","open"]
["136","UFC","GB62","Gulbarga","F8 1St Floor Asian Complex","Near City Bus Stand Head Post Office Road","Super Market","Gulbarga","Karnataka",585101,"08472-223666","-",true,"-","utigulbargaufc@Kfintech.com","open"]
["-","UFC","HU50","Hubli","1St Floor Kalburgi Square","Near Desai Cross Tb Road","-","Hubli","Karnataka",580029,"(0836) 2363963/2362061/2363188","-",true,"-","utihubliufc@Kfintech.com","open"]
["-","UFC","MN38","Mangalore","Door NO - 14-3-190","1st Floor Souza Arcade","Near Jyothi Talkies","Mangalore","Karnataka",575001,"0824-2444112","-",true,"-","utimangaloreufc@Kfintech.com","open"]
["104","UFC","MR75","Margao","Shop No: G6 & G7","Jeevottam Sundra 81","Primitive Hospicio Road Bhd. Cine Metropole","Margao","Goa",403601,"0832- 6484613","-",true,"-","utimargoaufc@Kfintech.com","open"]
["-","UFC","MY77","Mysore","UTI Financial Centre","No.11 Kamakshi Hospital Road 8th Cross","Saraswathipuram","Mysore","Karnataka",570009,8212344425,"-",true,"-","utimysoreufc@Kfintech.com","open"]
["-","UFC","GO37","Panjim","Edc House","Mezzanine Floor","Dr A B Marg","Panaji Goa","Goa",403001,"0832 2230064","-",true,"-","utipanajiufc@Kfintech.com","open"]
["-","OPA","SH59","Shimoga","JAYARAMA NILAYA","2ND CORSS","MISSION COMPOUND","Shimoga","Karnataka",577201,"08182 295491","-",true,"-","mfsshimoga@Kfintech.com","Open"]
["Shri. Walter Cyril Pinto   ","BDA","UP04","Udupi","Vishnu Prakash Bldg","Court Road","Feather Communication","Udipi","Karnataka",576101,8202521194,"-",true,"-","mfsudipicr@kfintech.com","open"]
["-","UFC","SH59","Shimogaa","321 Ground Floor","P Square 5th Parallel Road","Durgigudi","Shivamogga","Karnataka",577201,"08182 – 295677/277703","-",true,"-","Kfpl.utishivamogaaufc@Kfintech.com","open"]
["-","UFC","AH01","Ahmedabad","2ND FLOOR IFCI BHAVAN","B/H TANISHQ SHOW ROOM","C G ROAD","Ahmedabad","Gujarat",380006,9081903024,"-",true,"-","utiahmedabadufc@Kfintech.com","open"]
["-","UFC","AD63","Anand","12 A First Floor Chitrangna Complex","First Floor","V V Nagar Road","Anand","Gujarat",388001,9081903039,"-",true,"-","utianandufc@Kfintech.com","open"]
["-","UFC","BR04","Baroda","G 6 & G 7 Land Mark Building","Race Course Road","Transpeck Centre","Baroda","Gujarat",390007,9725013177,"-",true,"-","utibarodaufc@Kfintech.com","open"]
["74","UFC","BU67","Bharuch","103/104/105 Aditya Complex","1St Floor","Near Kashak Circle","Bharuch","Gujarat",392001,"02642 225460","-",true,"-","utibharuchufc@Kfintech.com","open"]
["-","UFC","BV68","Bhavnagar","6/7 Ground Floor  Shree Complex","Crecent Circle","Opp Gandhi Smruti","Bhavnagar","Gujarat",364001,"0278-3201307","-",true,"-","utibhavnagarufc@Kfintech.com","open"]
["-","UFC","BJ01","Bhuj","13 & 14 First Floor","Jubilee Circle Banker'S Colony","Opp All India Radio","Bhuj","Gujarat",370001,9081903026,"-",true,"-","utibhujufc@Kfintech.com","open"]
["-","OPA","GD16","Gandhidham","Shop # 12 Shree Ambica Arcade Plot # 300","Ward 12. Opp. CG High School ","Near HDFC Bank","Gandhidham","Gujarat",370201,9081903027,"-",true,"-","mfsgandhidham@Kfintech.com","Open"]
["87","UFC","GA01","Gandhinagar","Dvij elite First Floor","Plot No 1522 Near Apna Bazar","Sector-6","Gandhi Nagar","Gujarat",382006,"079-23240462","-",true,"-","utigandhinagarufc@Kfintech.com","open"]
["-","UFC","JN12","Jamnagar","102-Madhav Squre","Opp .Avantika complex","Nr. lal bunglow","Jamnagar","Gujarat",361001,9081903043,"-",true,"-","utijamnagarufc@Kfintech.com","open"]
["111","UFC","NV40","Navsari","1/4 Chinmay Arcade","Tower Road","Near Sattapir Road","Navsari","Gujarat",396445,"02637 280528","-",true,"-","utinavsariufc@Kfintech.com","open"]
["-","UFC","RJ61","Rajkot","1st Floor venkatesh plaza Opp. BKC Ground","DR. Radhakrishna road off yagnik road","-","Rajkot","Gujarat",360001,"0281-2440701","-",true,"-","utirajkotufc@Kfintech.com","open"]
["-","UFC","SU19","Surat","B-107/108 Tirupati Plaza","Athwa Gate","Near Collector Office","Surat","Gujarat",395001,"0261 4006099","-",true,"-","utisuratufc@Kfintech.com","open"]
["-","UFC","VP95","Vapi","1st Floor Office No: 102 & 103","SAGA CASA Complex ","Vapi-Daman Main Road Opp. Royal Twin Tower","Chala Vapi","Gujarat",396191,9081903029,"-",true,"-","utivapiufc@Kfintech.com","open"]
["-","BDA","SB85","Sabarkantha (Himmatnagar)","B-1  Deshkanta Memon Complex","Opp Power House","Hajipura","Himatnagar","Gujarat",383001,7818821819,"-",true,"2014-08-13","mfsSabarkanthacr@kfintech.com","open"]
["-","OPA","ND85","Nadiad","311-3rd Floor City Center ","Near Paras Circle","-","Nadiad","Gujarat",387001,"0268-2563245","-",true,"2016-04-01","mfsnadiad@Kfintech.com","Open"]
["92","UFC","JD01","Junagadh","UTI Financial Center","1st Floor Shop No 101102113 & 114 Maerry Gold 2","Above Dominos Pizza Opp Bahaudin colleage rooad","Junagadh","Gujarat",362001,"0285-2672678","-",true,"2019-03-26","Kfpl.utijunagadhufc@Kfintech.com ","open"]
["135","UFC","VD40","Valsad","UTI Financial Center","1st Floor103 Signature Building","Opp Yes Bank Dharampur RoadHalar.","Valsad","Gujarat",396001,"02632-222012","-",true,"-","Kfpl.utivalsadufc@Kfintech.com ","open"]
["-","UFC","MD17","Chennai","Capital Tower Ground Floor","180 Kodambakkam High Road","Nungambakkam","Chennai","Tamil Nadu",600034,"044 28516333 ","-",true,"-","utichennaiufc@Kfintech.com","open"]
["-","UFC","AN13","Chennai-Anna Nagar","W-123","3Rd Avenue","Anna Nagar","Chennai","Tamil Nadu",600040,"044-42615016","-",true,"-","utiannanagarufc@Kfintech.com","open"]
["-","UFC","TN14","Chennai-T Nagar","No/29","North Usman Road","Tnagar","Chennai","Tamil Nadu",600017,"044-42121648","-",true,"-","utitnagarufc@Kfintech.com","open"]
["-","UFC","CL69","Calicut (Kozhikode)","Aydeed Complex","YMCA Cross Road","Kozhikode","Calicut","Kerala",673001,"(0495) 2367284 ","-",true,"-","uticalicutufc@Kfintech.com","open"]
["-","UFC","CO08","Cochin","Ground Floor Palackal Building Chittoor Road ","Iyyattil Junction","Opp Kavitha International Hotel","Ernakulam ","Kerala",682011,"0484 - 2380259","-",true,"-","uticochinufc@Kfintech.com","open"]
["99","UFC","KT75","Kottayam","17/480-FMuringampadam ChambersGround Floor","Cms College Road","Cms College Jn","Kottayam","Kerala",686001,"0481-2560734","-",true,"-","utikottayamufc@Kfintech.com","open"]
["-","OPA","PG35","Palghat","No: 20 & 21 ","Metro Complex H.P.O.Road Palakkad","H.P.O.Road","Palakkad","Kerala",678001,9895968533,"-",true,"-","mfspalghat@Kfintech.com","Close"]
["-","UFC","TU51","Trichur","26/621-622 Kollannur Devassy Bldg","Town Hall Road","Near Paramekavu Temple","Thrissur","Kerala",680020,"0487-2331259",2331496,true,"-","utitrichurufc@Kfintech.com","open"]
["-","UFC","TV52","Trivandrum","T C 15/49 ( 2 )","1st Floor, Saran Chambers","Vellayambalam","Thiruvananthapuram","Kerala",675010,"(0471) 2723674/2721415/2720310","-",true,"-","utitrivandrumufc@Kfintech.com","open"]
["-","OPA","KM12","Kollam","SREE VIGNESWARA BHAVAN","SHASTRI JUNCTION","-","Kollam","Kerala",691001,"474-2747055","-",true,"-","mfskollam@Kfintech.com","Open"]
["-","BDA","AN08","Ankamaly","Parayil Agencies","Ankamaly South P O","Ankamaly","Cochin","Kerala",683573,"0484 - 2452560","-",true,"2014-12-23","mfsangamalycr@kfintech.com","open"]
["-","OPA","KU29","Kannur","2ND FLOOR","GLOBAL VILLAGE","BANK ROAD","Kannur","Kerala",{"$f":"VLOOKUP(Table1[[#This Row],[Location]],'[1]MFS Add.List'!$D$1:$Q$178,14,0)","v":670001},"0497 - 2764190","-",true,"2015-08-03","mfskannur@Kfintech.com","Open"]
["-","OPA","TI76","Tiruvalla","2Nd FloorErinjery Complex","Ramanchira","Opp Axis Bank","Thiruvalla","Kerala",{"$f":"VLOOKUP(Table1[[#This Row],[Location]],'[1]MFS Add.List'!$D$1:$Q$178,14,0)","v":689107},"04862-211209","-",true,"2015-08-14","mfstiruvalla@Kfintech.com","Open"]
["-","BDA","AY35","Alleppy","MJM Building ","Mullakal","Alappuzha","Alleppy","Kerala",688011,"0477 2251110","-",true,"2015-09-01","alleppycr@Kfintech.com","open"]
["-","UFC","CB06","Coimbatore","UTI Financial Centre \"R G Chambers\" First Floor ","1023 Avinashi Road","Coimbatore","Coimbatore","Tamil Nadu",641018,"0422 4393918","-",true,"-","uticoimbatoreufc@Kfintech.com","open"]
["-","OPA","ER70","Erode","Address No 38/1 Ground Floor","Sathy Road,(VCTV Main Road)","Sorna Krishna Complex","Erode","Tamil Nadu",{"$f":"VLOOKUP(Table1[[#This Row],[Location]],'[1]MFS Add.List'!$D$1:$Q$178,14,0)","v":638003},"0424-4021212","-",true,"-","mfserode@Kfintech.com","Open"]
["-","UFC","MR31","Madurai","No. 3 West Marret Street","LIC Building - 1st Floor","Opposit to Railway Station","Madurai","Tamil Nadu",625001,"(0452) 2338186/2333317","-",true,"-","utimaduraiufc@Kfintech.com","open"]
["-","OPA","NK25","Nagerkoil","HNO 45 ","1st Floor","East Car Street ","Nagercoil","Tamil Nadu",{"$f":"VLOOKUP(Table1[[#This Row],[Location]],'[1]MFS Add.List'!$D$1:$Q$178,14,0)","v":629001},"04652 - 233552","-",true,"-","mfsnagarkoil@Kfintech.com","Open"]
["123","UFC","SA81","Salem","No. 20 Ramakrishna Road","Above Federal Bank","-","Salem","Tamil Nadu",636007,"0427 4040273 ","-",true,"-","utisalemufc@Kfintech.com","open"]
["132","UFC","TV50","Tirunelveli","1st Floor 10/4 Thaha Plaza","South Bypass Road","Vannarpet","Tirunelveli","Tamil Nadu",627003,"0462 2502775 ","-",true,"-","utitirunelveliufc@Kfintech.com","open"]
["-","UFC","TU49","Tirupur","1st Floor Tip Top Business Centre ","(Near Railway Station Rear Entrance)","104-109 College Road","Tirupur","Tamil Nadu",641602,"0421 4243918 ","-",true,"-","utitirupurufc@Kfintech.com","open"]
["-","UFC","TR30","Trichy","No 19/1 Kingston Park","Puthur High Road","Opp. Aruna Theatre \nPuthur woriyur","Tiruchirapalli","Tamil Nadu",620017,"0431 4040272 ","-",true,"-","utitrichyufc@Kfintech.com","open"]
["-","OPA","TC40","Tuticorin","4 - B A34 - A37","Mangalmal Mani Nagar","Opp. Rajaji Park Palayamkottai Road","Tuticorin","Tamil Nadu",{"$f":"VLOOKUP(Table1[[#This Row],[Location]],'[1]MFS Add.List'!$D$1:$Q$178,14,0)","v":628003},"0461-2334603","-",true,"-","mfstuticorin@Kfintech.com","Open"]
["-","UFC","VL88","Vellore","SAI RAJYA\"","First Floor Back side","No.14Anna Salai (Officers line)","Vellore ","Tamil Nadu",632001,"0416 4200901 ","-",true,"-","utivelloreufc@Kfintech.com","open"]
["Shri. A Giri ","BDA","KB85","Kumbakonam","4 & 5 KVJ Complex ","-","49 T S R Big Street ","Kumbakonam","Tamilnadu",612001,"0435- 2431063 ","-",true,"2014-08-13","mfsKumbakonamcr@kfintech.com","open"]
["117","UFC","PO50","Pondicherry","No. 20 Savitha Plaza","100 Feet Road","Anna Nagar","Pondicherry","Pondicherry ",605005,"0413 2203369","-",true,"2019-10-18","utipondicherryufc@Kfintech.com","open"]
["-","UFC","AG01","Agartala","Surjya Chowmuhani","H G B Road","-","Agartala","Tripura",799001,"0381-2383995","-",true,"2013-06-01","utiagartalaufc@Kfintech.com ","open"]
{"$rows_left_out":180}
{"sheet":"KFintech ISC","index":2,"n_rows":198,"n_cols":10,"rows_kept":198,"cut":false,"hidden":true,"merged":[]}
["S.No","Branch Type","Region","Branch Name","State","Zone Status","Consolidated Current Addrees","Landline#"," Branch Email","Open Status as of 28 Aug'20"]
[1,"MFS","Bangalore","Bangalore","Karnataka","Red Zone","KFin Technologies Pvt. Ltd,No 35,Puttanna Road,Basavanagudi,Bangalore 560004","080-26602852","bangaloremfd@Kfintech.com","Open"]
[2,"MFS","Bangalore","Belgaum","Karnataka","Red Zone","KFin Technologies Pvt. Ltd,Premises No.101, CTS NO.1893,Shree Guru Darshani Tower,Anandwadi, Hindwadi,Belgaum  590011","0831 2402544","mfsbelgaum@Kfintech.com","Open"]
[3,"MFS","Bangalore","Bellary","Telangana","Orange Zone","KFin Technologies Pvt. Ltd,Shree Gayathri Towers #4,1st Floor K.H.B.Colony,Gopalaswamy Mudaliar Road,Gandhi Nagar-Bellary 583103","08392 – 254750 ","mfsbellary@Kfintech.com ","Open"]
[4,"MFS","Bangalore","Davangere","Karnataka","Red Zone","KFin Technologies Pvt. Ltd,D.No 162/6 , 1st Floor, 3rd Main,P J Extension,Davangere taluk, Davangere Manda,Davangere 577002","0819-2258714","mfsdavangere@Kfintech.com","Open"]
[5,"MFS","Bangalore","Dharwad","Karnataka","Red Zone","KFin Technologies Pvt. Ltd,ADINATH COMPLEX,BESIDE KAMAL AUTOMOBILES, BHOOVI GALLI,OPP OLD LAXMI TALKIES, P B ROAD,Dharwad 580001","0836- 2744207","mfsdharwad@Kfintech.com","Open"]
[6,"MFS","Bangalore","Gulbarga","Karnataka","Red Zone","KFin Technologies Pvt. Ltd,H NO 2-231,KRISHNA COMPLEX, 2ND FLOOR Opp.,Opp. Municipal corporation Office,Jagat, Station Main Road, KALABURAGI,Gulbarga 585105","08472 252503","mfsgulbarga@Kfintech.com","Open"]
[7,"MFS","Bangalore","Hassan","Karnataka","Red Zone","KFin Technologies Pvt. Ltd,SAS NO: 490, HEMADRI ARCADE,2ND MAIN ROAD,SALGAME ROAD NEAR BRAHMINS BOYS HOSTEL,Hassan  573201","08172 262065","mfshassan@Kfintech.com","Open"]
[8,"MFS","Bangalore","Hubli","Karnataka","Orange Zone","KFin Technologies Pvt. Ltd,R R MAHALAXMI MANSION,ABOVE INDUSIND BANK, 2ND FLOOR,DESAI CROSS, PINTO ROAD,Hubballi 580029","0836-2252444","mfshubli@Kfintech.com","Open"]
[9,"MFS","Bangalore","Mangalore","Karnataka","Orange Zone","KFin Technologies Pvt. Ltd,Mahendra Arcade Opp Court Road,Karangal Padi,-,Mangalore 575003","0824-2496289","mangaloremfd@Kfintech.com","Open"]
[10,"MFS","Bangalore","Margao","Goa","Green Zone","KFin Technologies Pvt. Ltd,2Nd Floor ,Dalal Commercial Complex,Pajifond,Margao  403601","0832-2731823 ","mfsmargoa@Kfintech.com","Open"]
[11,"MFS","Bangalore","Mysore","Karnataka","Green Zone","KFin Technologies Pvt. Ltd,L-350Silver Tower,Ashoka Road,Opp.Clock Tower ,Mysore  570001","0821-2438006","mfsmysore@Kfintech.com","Open"]
[12,"MFS","Bangalore","Panjim","Goa","Green Zone","KFin Technologies Pvt. Ltd,H. No: T-9, T-10, Affran plaza,3rd Floor,Near Don Bosco High School,Panjim 403001","0832-2426874","panjimmfd@Kfintech.com","Open"]
[13,"MFS","Bangalore","Shimoga","Karnataka","Red Zone","KFin Technologies Pvt. Ltd,JAYARAMA NILAYA,2ND CORSS,MISSION COMPOUND,Shimoga 577201","08182-228799","mfsshimoga@Kfintech.com","Open"]
[14,"MFS","Baroda","Ahmedabad","Gujarat","Red Zone","KFin Technologies Pvt. Ltd,Office No. 401, on 4th Floor,ABC-I, Off. C.G. Road,-,Ahmedabad 380009",9081903021,"ahmedabadmfd@Kfintech.com","Open"]
[15,"MFS","Baroda","Anand","Gujarat","Red Zone","KFin Technologies Pvt. Ltd,B-42 Vaibhav Commercial Center,Nr Tvs Down Town Shrow Room  ,Grid Char Rasta  ,Anand  380001",9081903038,"mfsanand@Kfintech.com","Open"]
[16,"MFS","Baroda","Baroda","Gujarat","Red Zone","KFin Technologies Pvt. Ltd,203 Corner point,Jetalpur Road,Baroda Gujarat,Baroda 390007","0265-2353506","barodamfd@Kfintech.com","Open"]
[17,"MFS","Baroda","Bharuch","Gujarat","Orange Zone","KFin Technologies Pvt. Ltd,123 Nexus business Hub,Near Gangotri Hotel,B/s Rajeshwari Petroleum,Makampur Road,Bharuch 392001",9081903042,"mfsbharuch@Kfintech.com","Open"]
[18,"MFS","Baroda","Bhavnagar","Gujarat","Red Zone","KFin Technologies Pvt. Ltd,303 STERLING POINT ,WAGHAWADI ROAD ,-,Bhavnagar 364001","278-3003149","mfsbhavnagar@Kfintech.com","Open"]
[19,"MFS","Baroda","Gandhidham","Gujarat","Red Zone","KFin Technologies Pvt. Ltd,Shop # 12 Shree Ambica Arcade Plot # 300,Ward 12. Opp. CG High School ,Near HDFC Bank,Gandhidham 370201",9081903027,"mfsgandhidham@Kfintech.com","Open"]
[20,"MFS","Baroda","Gandhinagar","Gujarat","Red Zone","KFin Technologies Pvt. Ltd,123 First Floor,Megh Malhar Complex,Opp. Vijay Petrol Pump Sector - 11,Gandhinagar 382011","079 23244955","mfsgandhinagar@Kfintech.com","Open"]
[21,"MFS","Baroda","Jamnagar","Gujarat","Orange Zone","KFin Technologies Pvt. Ltd,131 Madhav Plazza, ,Opp Sbi Bank,Nr Lal Bunglow,Jamnagar 361008","0288 3065810","mfsjamnagar@Kfintech.com","Open"]
[22,"MFS","Baroda","Junagadh","Gujarat","Green Zone","KFin Technologies Pvt. Ltd,124-125 Punit Shopping Center,M.G Road,Ranavav Chowk,Junagadh 362001","0285-2652220","mfsjunagadh@Kfintech.com","Open"]
[23,"MFS","Baroda","Mehsana","Gujarat","Orange Zone","KFin Technologies Pvt. Ltd,FF-21 Someshwar Shopping Mall ,Modhera Char Rasta,-,Mehsana 384002","02762-242950","mfsmehsana@Kfintech.com","Open"]
[24,"MFS","Baroda","Nadiad","Gujarat","Red Zone","KFin Technologies Pvt. Ltd,311-3rd Floor City Center ,Near Paras Circle,-,Nadiad 387001","0268-2563245","mfsnadiad@Kfintech.com","Open"]
[25,"MFS","Baroda","Navsari","Gujarat","Orange Zone","KFin Technologies Pvt. Ltd,103  1ST FLOORE LANDMARK MALL,NEAR SAYAJI LIBRARY ,Navsari Gujarat,Navsari 396445",9081903040,"mfsnavsari@Kfintech.com","Open"]
[26,"MFS","Baroda","Rajkot","Gujarat","Orange Zone","KFin Technologies Pvt. Ltd,302 Metro Plaza ,Near Moti Tanki Chowk,Rajkot,Rajkot Gujarat 360001",9081903025,"rajkotmfd@Kfintech.com","Open"]
[27,"MFS","Baroda","Surat","Gujarat","Red Zone","KFin Technologies Pvt. Ltd,Office no: -516 5th Floor Empire State building ,Near Udhna Darwaja,Ring Road,Surat 395002",9081903041,"suratmf@Kfintech.com","Open"]
[28,"MFS","Baroda","Valsad","Gujarat","Orange Zone","KFin Technologies Pvt. Ltd,406 Dreamland Arcade,Opp Jade Blue,Tithal Road,Valsad 396001","02632-258481","mfsvalsad@Kfintech.com","Open"]
[29,"MFS","Baroda","Vapi","Gujarat","Orange Zone","KFin Technologies Pvt. Ltd,A-8  FIRST FLOOR SOLITAIRE BUSINESS CENTRE,OPP DCB BANK  GIDC CHAR RASTA,SILVASSA ROAD,Vapi 396191",9081903028,"mfsvapi@Kfintech.com","Open"]
[30,"MFS","Chennai","Chennai","Tamil Nadu","Red Zone","KFin Technologies Pvt. Ltd,F-11 Akshaya Plaza 1St Floor,108 Adhithanar Salai,Egmore Opp To Chief Metropolitan Court,Chennai 600002","044-42028512","chennaimfd@Kfintech.com","Close"]
[31,"Collection Center","Chennai","T Nagar/Nungambakkam","Tamilnadu","Green Zone","KFin Technologies Pvt. Ltd,No 23 | Cathedral Garden Road,Cathedral Garden Road,Nungambakkam,Chennai,600 034","         044 - 28309100","chennaimfd@Kfintech.com","Open"]
[32,"MFS","Cochin","Alleppy","Kerala","Orange Zone","KFin Technologies Pvt. Ltd,1st Floor Jp Towers,Mullackal,Ksrtc Bus Stand,Alleppy 688011","0477 2263055","mfsalleppy@Kfintech.com","Open"]
[33,"MFS","Cochin","Calicut","Kerala","Orange Zone","KFin Technologies Pvt. Ltd,Second Floor,Manimuriyil Centre, Bank Road,,Kasaba Village,Calicut 673001","0495-4022480","mfscalicut@Kfintech.com","Open"]
[34,"MFS","Cochin","Cochin","Kerala","Green Zone","KFin Technologies Pvt. Ltd,Ali Arcade 1St FloorKizhavana Road,Panampilly Nagar,Near Atlantis Junction,Ernakualm 682036","0484 - 4025059","cochinmfd@Kfintech.com","Open"]
[35,"MFS","Cochin","Kannur","Kerala","Red Zone","KFin Technologies Pvt. Ltd,2ND FLOOR,GLOBAL VILLAGE,BANK ROAD,Kannur 670001","0497-2764190","mfskannur@Kfintech.com","Open"]
[36,"MFS","Cochin","Kollam","Kerala","Orange Zone","KFin Technologies Pvt. Ltd,GROUND FLOORA NARAYANAN SHOPPING COMPLEX,KAUSTHUBHSREE BLOCK,Kadapakada,Kollam 691008","474-2747055","mfskollam@Kfintech.com","Open"]
[37,"MFS","Cochin","Kottayam","Kerala","Red Zone","KFin Technologies Pvt. Ltd,1St Floor Csiascension Square,Railway Station Road,Collectorate P O,Kottayam 686002","0481-2300868/2302420","mfskottayam@Kfintech.com","Open"]
[38,"MFS","Cochin","Malappuram","Kerala","Orange Zone","KFin Technologies Pvt. Ltd,2nd Floor,Peekays Arcade,Down Hill,Malappuram 676505","0483-2731480","mfsmalappuram@Kfintech.com","Open"]
[39,"MFS","Cochin","Palghat","Kerala","Orange Zone","KFin Technologies Pvt. Ltd,No: 20 & 21 ,Metro Complex H.P.O.Road Palakkad,H.P.O.Road,Palakkad 678001",9895968533,"mfspalghat@Kfintech.com","Open"]
[40,"MFS","Cochin","Tiruvalla","Kerala","Orange Zone","KFin Technologies Pvt. Ltd,2Nd FloorErinjery Complex,Ramanchira,Opp Axis Bank,Thiruvalla 689107","04862-211209","mfstiruvalla@Kfintech.com","Open"]
[41,"MFS","Cochin","Trichur/Thrissur","Kerala","Orange Zone","KFin Technologies Pvt. Ltd,4TH FLOOR, CROWN TOWER,SHAKTHAN NAGAR,OPP. HEAD POST OFFICE,Thrissur 680001","0487- 6999987","mfstrichur@Kfintech.com","Open"]
[42,"MFS","Cochin","Trivandrum","Kerala","Orange Zone","KFin Technologies Pvt. Ltd,MARVEL TOWER, 1ST FLOOR,URA-42 STATUE,(UPPALAM ROAD RESIDENCE ASSOCIATION) ,Trivandrum 695010","0471 - 2725728","mfstrivandrum@Kfintech.com","Open"]
[43,"MFS","Coimbatore","Coimbatore","Tamil Nadu","Green Zone","KFin Technologies Pvt. Ltd,3rd Floor Jaya Enclave,1057 Avinashi Road,-,Coimbatore 641018","0422 - 4388011","mfscoimbatore@Kfintech.com","Open"]
[44,"MFS","Coimbatore","Dindigul","Tamil Nadu","Red Zone","KFin Technologies Pvt. Ltd,NO 59B New Pensioner street,Palani Road,,Opp Gomathi Lodge,Dindigul 624001","0451- 2436177","mfsdindigul@Kfintech.com","Open"]
[45,"MFS","Coimbatore","Erode","Tamil Nadu","Red Zone","KFin Technologies Pvt. Ltd,Address No 38/1 Ground Floor,Sathy Road,(VCTV Main Road),Sorna Krishna Complex,Erode 638003","0424-4021212","mfserode@Kfintech.com","Open"]
[46,"MFS","Coimbatore","Karur","Tamil Nadu","Red Zone","KFin Technologies Pvt. Ltd,No 88/11, BB plaza,NRMP street,K S Mess Back side,Karur 639002","04324-241755","mfskarur@Kfintech.com","Open"]
[47,"MFS","Coimbatore","Madurai","Tamil Nadu","Red Zone","KFin Technologies Pvt. Ltd,No. G-16/17,AR Plaza, 1st floor,North Veli Street,Madurai 625001","0452-2605856","mfsmadurai@Kfintech.com","Open"]
[48,"MFS","Coimbatore","Nagerkoil","Tamil Nadu","Orange Zone","KFin Technologies Pvt. Ltd,HNO 45 ,1st Floor,East Car Street ,Nagercoil 629001","04652 - 233552","mfsnagarkoil@Kfintech.com","Open"]
[49,"MFS","Coimbatore","Pollachi","Tamil Nadu","Orange Zone","KFin Technologies Pvt. Ltd,1st floor,MKG complex,Opp to Gowri Shankar Hotel,-,Pollachi 642001","04259- 235111","mfspollachi@Kfintech.com","Open"]
[50,"MFS","Coimbatore","Pondicherry","Pondicherry ","Orange Zone","KFin Technologies Pvt. Ltd,No 122(10b),Muthumariamman koil street,-,Pondicherry 605001","0413-4300710","mfspondy@Kfintech.com","Open"]
[51,"MFS","Coimbatore","Salem","Tamil Nadu","Orange Zone","KFin Technologies Pvt. Ltd,NO 3/250 ,Pondicherry - 605001,6th CrossPerumal kovil back side Fairland's,Salem 636016","0427-4020300","mfssalem@Kfintech.com","Open"]
[52,"MFS","Coimbatore","Thanjavur","Tamil Nadu","Orange Zone","KFin Technologies Pvt. Ltd,No 1, Basement,Nallaiyah Complex,Srinivasam pillai road,Thanjavur 613001","04362-275415","mfsthanjavur@Kfintech.com","Open"]
[53,"MFS","Coimbatore","Tirunelveli","Tamil Nadu","Red Zone","KFin Technologies Pvt. Ltd,55/18 Jeney Building,S N Road,Near Aravind Eye Hospital,Tirunelveli 627001","0462-4001416","mfstirunelveli@Kfintech.com","Open"]
[54,"MFS","Coimbatore","Tirupur","Tamil Nadu","Red Zone","KFin Technologies Pvt. Ltd,No 669A,Kamaraj Road,,Near old collector office,,Tirupur 641604","0421-2214221","mfstirupur@Kfintech.com","Close"]
[55,"MFS","Coimbatore","Trichy","Tamil Nadu","Orange Zone","KFin Technologies Pvt. Ltd,No 23C/1 E V R road, Near Vekkaliamman Kalyana Mandapam,Putthur,-,Trichy 620017","0431-4020227","mfstrichy@Kfintech.com","Open"]
[56,"MFS","Coimbatore","Tuticorin","Tamil Nadu","Red Zone","KFin Technologies Pvt. Ltd,4 - B A34 - A37,Mangalmal Mani Nagar,Opp. Rajaji Park Palayamkottai Road,Tuticorin 628003","0461-2334603","mfstuticorin@Kfintech.com","Open"]
[57,"MFS","Coimbatore","Vellore","Tamil Nadu","Containmment","KFin Technologies Pvt. Ltd,No 2/19,1st floor,Vellore city centre,Anna salai,Vellore 632001","0416-41603806","mfsvellore@Kfintech.com","Open"]
[58,"MFS","Guwahati","Agartala","Tripura","Green Zone","KFin Technologies Pvt. Ltd,OLS RMS CHOWMUHANI,MANTRI BARI ROAD1ST FLOOR NEAR TRAFFIC POINT,TRIPURA WEST,Agartala 799001","0381-2317519","mfsagartala@Kfintech.com","Open"]
[59,"MFS","Guwahati","Guwahati","Assam","Green Zone","KFin Technologies Pvt. Ltd,1st Floor Bajrangbali Building,Near Bora Service Station GS Road,-,Guwahati 781007",8811036746,"mfsguwahati@Kfintech.com","Open"]
{"$rows_left_out":138}